Reaction Details
TargetC-terminal-binding protein 2
LigandBDBM50167979
Substrate/Competitorn/a
Meas. Tech.ChEMBL_1574551 (CHEMBL3804623)
IC50 720±n/a nM
Citation Korwar, SMorris, BLParikh, HICoover, RADoughty, TWLove, IMHilbert, BJRoyer, WEKellogg, GEGrossman, SREllis, KC Design, synthesis, and biological evaluation of substrate-competitive inhibitors of C-terminal Binding Protein (CtBP). Bioorg Med Chem24:2707-15 (2016) 
 
C-terminal-binding protein 2
Name:C-terminal-binding protein 2
Type:Protein
Mol. Mass.:48948.33
Organism:Homo sapiens (Human)
Description:P56545
Residue:445
BDBM50167979
NameBDBM50167979
Synonyms:CHEMBL3799689
TypeSmall organic molecule
Emp. Form.C9H9NO4
Mol. Mass.195.1721
SMILESO\N=C(\Cc1cccc(O)c1)C(O)=O