Reaction Details
TargetC-terminal-binding protein 2
LigandBDBM50167980
Substrate/Competitorn/a
Meas. Tech.ChEMBL_1574551 (CHEMBL3804623)
IC50 300±n/a nM
Citation Korwar, SMorris, BLParikh, HICoover, RADoughty, TWLove, IMHilbert, BJRoyer, WEKellogg, GEGrossman, SREllis, KC Design, synthesis, and biological evaluation of substrate-competitive inhibitors of C-terminal Binding Protein (CtBP). Bioorg Med Chem24:2707-15 (2016) 
 
C-terminal-binding protein 2
Name:C-terminal-binding protein 2
Type:Protein
Mol. Mass.:48948.33
Organism:Homo sapiens (Human)
Description:P56545
Residue:445
BDBM50167980
NameBDBM50167980
Synonyms:CHEMBL3800609
TypeSmall organic molecule
Emp. Form.C9H8FNO3
Mol. Mass.197.1631
SMILESO\N=C(\Cc1ccc(F)cc1)C(O)=O