Reaction Details
TargetMacrophage migration inhibitory factor
LigandBDBM92515
Substrate/Competitorn/a
Meas. Tech.ChEMBL_1574570 (CHEMBL3804642)
IC50 570±n/a nM
Citation Cisneros, JARobertson, MJValhondo, MJorgensen, WL Irregularities in enzyme assays: The case of macrophage migration inhibitory factor. Bioorg Med Chem Lett26:2764-2767 (2016) 
 
Macrophage migration inhibitory factor
Name:Macrophage migration inhibitory factor
Type:Enzyme
Mol. Mass.:12478.18
Organism:Homo sapiens (Human)
Description:P14174
Residue:115
BDBM92515
NameBDBM92515
Synonyms:RDR 03785, 11
TypeSmall organic molecule
Emp. Form.C19H18F3NO4
Mol. Mass.381.3457
SMILESOc1cc2OCOc2cc1C(N1CCOCC1)c1ccc(cc1)C(F)(F)F