Reaction Details
TargetMacrophage migration inhibitory factor
LigandBDBM53132
Substrate/Competitorn/a
Meas. Tech.ChEMBL_1574566 (CHEMBL3804638)
Ki 26600±n/a nM
Citation Cisneros, JARobertson, MJValhondo, MJorgensen, WL Irregularities in enzyme assays: The case of macrophage migration inhibitory factor. Bioorg Med Chem Lett26:2764-2767 (2016) 
 
Macrophage migration inhibitory factor
Name:Macrophage migration inhibitory factor
Type:Enzyme
Mol. Mass.:12478.18
Organism:Homo sapiens (Human)
Description:P14174
Residue:115
BDBM53132
NameBDBM53132
Synonyms:4-(2-imidazo[1,2-a]pyridinyl)benzene-1,2-diol 4-imidazo[1,2-a]pyridin-2-ylbenzene-1,2-diol MLS001208128 cid_764266
TypeSmall organic molecule
Emp. Form.C13H10N2O2
Mol. Mass.226.2307
SMILESOc1ccc(cc1O)-c1cn2ccccc2n1