Reaction Details
TargetMacrophage migration inhibitory factor
LigandBDBM50013032
Substrate/Competitorn/a
Meas. Tech.ChEMBL_1574567 (CHEMBL3804639)
Ki 4270±n/a nM
Citation Cisneros, JARobertson, MJValhondo, MJorgensen, WL Irregularities in enzyme assays: The case of macrophage migration inhibitory factor. Bioorg Med Chem Lett26:2764-2767 (2016) 
 
Macrophage migration inhibitory factor
Name:Macrophage migration inhibitory factor
Type:Enzyme
Mol. Mass.:12478.18
Organism:Homo sapiens (Human)
Description:P14174
Residue:115
BDBM50013032
NameBDBM50013032
Synonyms:CHEMBL1604170
TypeSmall organic molecule
Emp. Form.C21H16N2O3S
Mol. Mass.376.428
SMILESOC(=O)c1cccc(NC(=S)NC(=O)c2ccc(cc2)-c2ccccc2)c1