Reaction Details
TargetPancreatic triacylglycerol lipase
LigandBDBM24567
Substrate/Competitorn/a
Meas. Tech.ChEMBL_1575199 (CHEMBL3800919)
IC50 12±n/a nM
Citation Ha, MTTran, MHAh, KJJo, KJKim, JKim, WDCheon, WJWoo, MHRyu, SHMin, BS Potential pancreatic lipase inhibitory activity of phenolic constituents from the root bark of Morus alba L. Bioorg Med Chem Lett26:2788-2794 (2016) 
 
Pancreatic triacylglycerol lipase
Name:Pancreatic triacylglycerol lipase
Type:Enzyme
Mol. Mass.:50080.69
Organism:Sus scrofa (Pig)
Description:P00591
Residue:450
BDBM24567
NameBDBM24567
Synonyms:(2S)-1-[(2S,3S)-3-hexyl-4-oxooxetan-2-yl]tridecan-2-yl (2S)-2-formamido-4-methylpentanoate Orlistat Tetrahydrolipstatin Xenical
TypeSmall organic molecule
Emp. Form.C29H53NO5
Mol. Mass.495.7348
SMILESCCCCCCCCCCC[C@@H](C[C@@H]1OC(=O)[C@H]1CCCCCC)OC(=O)[C@H](CC(C)C)NC=O