Reaction Details
TargetPancreatic triacylglycerol lipase
LigandBDBM50303006
Substrate/Competitorn/a
Meas. Tech.ChEMBL_1575199 (CHEMBL3800919)
IC50 90±n/a nM
Citation Ha, MTTran, MHAh, KJJo, KJKim, JKim, WDCheon, WJWoo, MHRyu, SHMin, BS Potential pancreatic lipase inhibitory activity of phenolic constituents from the root bark of Morus alba L. Bioorg Med Chem Lett26:2788-2794 (2016) 
 
Pancreatic triacylglycerol lipase
Name:Pancreatic triacylglycerol lipase
Type:Enzyme
Mol. Mass.:50080.69
Organism:Sus scrofa (Pig)
Description:P00591
Residue:450
BDBM50303006
NameBDBM50303006
Synonyms:CHEMBL517247 | mulberrofuran D
TypeSmall organic molecule
Emp. Form.C29H34O4
Mol. Mass.446.5779
SMILES[#6]\[#6](-[#6])=[#6]\[#6]-[#6]\[#6](-[#6])=[#6]\[#6]-c1c(-[#8])ccc2cc(oc12)-c1cc(-[#8])cc(-[#8])c1-[#6]\[#6]=[#6](\[#6])-[#6]