Reaction Details
TargetPancreatic triacylglycerol lipase
LigandBDBM50168021
Substrate/Competitorn/a
Meas. Tech.ChEMBL_1575199 (CHEMBL3800919)
IC50 760±n/a nM
Citation Ha, MTTran, MHAh, KJJo, KJKim, JKim, WDCheon, WJWoo, MHRyu, SHMin, BS Potential pancreatic lipase inhibitory activity of phenolic constituents from the root bark of Morus alba L. Bioorg Med Chem Lett26:2788-2794 (2016) 
 
Pancreatic triacylglycerol lipase
Name:Pancreatic triacylglycerol lipase
Type:Enzyme
Mol. Mass.:50080.69
Organism:Sus scrofa (Pig)
Description:P00591
Residue:450
BDBM50168021
NameBDBM50168021
Synonyms:CHEMBL3800241
TypeSmall organic molecule
Emp. Form.C24H24O4
Mol. Mass.376.445
SMILES[#6]\[#6](-[#6])=[#6]\[#6]-[#6]C1([#6])[#8]-c2cc(cc(-[#8])c2-[#6]=[#6]1)-c1cc2ccc(-[#8])cc2o1