Reaction Details
TargetSodium-dependent serotonin transporter
LigandBDBM50168070
Substrate/Competitorn/a
Meas. Tech.ChEMBL_1575706 (CHEMBL3800926)
Ki 27±n/a nM
Citation Brinkø, ALarsen, MTKoldsø, HBesenbacher, LKolind, ASchiøtt, BSinning, SJensen, HH Synthesis and inhibitory evaluation of 3-linked imipramines for the exploration of the S2 site of the human serotonin transporter. Bioorg Med Chem24:2725-38 (2016) 
 
Sodium-dependent serotonin transporter
Name:Sodium-dependent serotonin transporter
Type:Multi-pass membrane protein
Mol. Mass.:70322.51
Organism:Homo sapiens (Human)
Description:P31645
Residue:630
BDBM50168070
NameBDBM50168070
Synonyms:CHEMBL3798035
TypeSmall organic molecule
Emp. Form.C21H24N2
Mol. Mass.304.4287
SMILESCN(C)CCCN1c2ccccc2CCc2ccc(cc12)C#C