Reaction Details
TargetSteryl-sulfatase
LigandBDBM50168215
Substrate/Competitorn/a
Meas. Tech.ChEMBL_1577236 (CHEMBL3807727)
Ki 250±n/a nM
Citation Shah, RSingh, JSingh, DJaggi, ASSingh, N Sulfatase inhibitors for recidivist breast cancer treatment: A chemical review. Eur J Med Chem114:170-90 (2016) 
 
Steryl-sulfatase
Name:Steryl-sulfatase
Type:Enzyme
Mol. Mass.:65503.66
Organism:Homo sapiens (Human)
Description:P08842
Residue:583
BDBM50168215
NameBDBM50168215
Synonyms:CHEMBL3804916
TypeSmall organic molecule
Emp. Form.C25H31BO3
Mol. Mass.390.323
SMILES[H][C@@]12CC[C@@](O)(Cc3ccccc3)[C@@]1(C)CC[C@]1([H])c3ccc(cc3CC[C@@]21[H])B(O)O