Reaction Details
TargetHexokinase-1
LigandBDBM50169020
Substrate/Competitorn/a
Meas. Tech.ChEMBL_1577557 (CHEMBL3807033)
IC50>200000±n/a nM
Citation Lin, HZeng, JXie, RSchulz, MJTedesco, RQu, JErhard, KFMack, JFRaha, KRendina, ARSzewczuk, LMKratz, PMJurewicz, AJCecconie, TMartens, SMcDevitt, PJMartin, JDChen, SBJiang, YNickels, LSchwartz, BJSmallwood, AZhao, BCampobasso, NQian, YBriand, JRominger, CMOleykowski, CHardwicke, MALuengo, JI Discovery of a Novel 2,6-Disubstituted Glucosamine Series of Potent and Selective Hexokinase 2 Inhibitors. ACS Med Chem Lett7:217-22 (2016) 
 
Hexokinase-1
Name:Hexokinase-1
Type:PROTEIN
Mol. Mass.:102488.34
Organism:Homo sapiens (Human)
Description:EBI_11382
Residue:917
BDBM50169020
NameBDBM50169020
Synonyms:CHEMBL3805806
TypeSmall organic molecule
Emp. Form.C16H19Cl2NO6
Mol. Mass.392.231
SMILESCOC1O[C@H](CO)[C@@H](O)[C@H](O)[C@H]1NC(=O)\C=C\c1ccc(Cl)c(Cl)c1