Reaction Details
TargetHexokinase-2
LigandBDBM50169017
Substrate/Competitorn/a
Meas. Tech.ChEMBL_1577558 (CHEMBL3807034)
IC50 790±n/a nM
Citation Lin, HZeng, JXie, RSchulz, MJTedesco, RQu, JErhard, KFMack, JFRaha, KRendina, ARSzewczuk, LMKratz, PMJurewicz, AJCecconie, TMartens, SMcDevitt, PJMartin, JDChen, SBJiang, YNickels, LSchwartz, BJSmallwood, AZhao, BCampobasso, NQian, YBriand, JRominger, CMOleykowski, CHardwicke, MALuengo, JI Discovery of a Novel 2,6-Disubstituted Glucosamine Series of Potent and Selective Hexokinase 2 Inhibitors. ACS Med Chem Lett7:217-22 (2016) 
 
Hexokinase-2
Name:Hexokinase-2
Type:PROTEIN
Mol. Mass.:102369.70
Organism:Homo sapiens (Human)
Description:ChEMBL_11422
Residue:917
BDBM50169017
NameBDBM50169017
Synonyms:CHEMBL3804930
TypeSmall organic molecule
Emp. Form.C21H19F3N2O6
Mol. Mass.452.3806
SMILESOC[C@H]1OC(O)[C@H](NC(=O)c2cc(cc(c2)C(F)(F)F)-c2ccc(cc2)C#N)[C@@H](O)[C@@H]1O