Reaction Details
TargetHexokinase-2
LigandBDBM50169034
Substrate/Competitorn/a
Meas. Tech.ChEMBL_1577558 (CHEMBL3807034)
IC50 50±n/a nM
Citation Lin, HZeng, JXie, RSchulz, MJTedesco, RQu, JErhard, KFMack, JFRaha, KRendina, ARSzewczuk, LMKratz, PMJurewicz, AJCecconie, TMartens, SMcDevitt, PJMartin, JDChen, SBJiang, YNickels, LSchwartz, BJSmallwood, AZhao, BCampobasso, NQian, YBriand, JRominger, CMOleykowski, CHardwicke, MALuengo, JI Discovery of a Novel 2,6-Disubstituted Glucosamine Series of Potent and Selective Hexokinase 2 Inhibitors. ACS Med Chem Lett7:217-22 (2016) 
 
Hexokinase-2
Name:Hexokinase-2
Type:PROTEIN
Mol. Mass.:102369.70
Organism:Homo sapiens (Human)
Description:ChEMBL_11422
Residue:917
BDBM50169034
NameBDBM50169034
Synonyms:CHEMBL3805734
TypeSmall organic molecule
Emp. Form.C26H26N2O9S
Mol. Mass.542.558
SMILESOC1O[C@H](CNS(=O)(=O)c2cccc(c2)C(O)=O)[C@@H](O)[C@H](O)[C@H]1NC(=O)c1cccc(c1)-c1ccccc1