Reaction Details
TargetMucosa-associated lymphoid tissue lymphoma translocation protein 1
LigandBDBM50169052
Substrate/Competitorn/a
Meas. Tech.ChEMBL_1577623 (CHEMBL3807231)
IC50 0.094000±n/a nM
Citation Abdel-Magid, AF MALT1 Inhibitors May Potentially Treat Lymphomas and Autoimmune Disorders. ACS Med Chem Lett7:205-6 (2016) 
 
Mucosa-associated lymphoid tissue lymphoma translocation protein 1
Name:Mucosa-associated lymphoid tissue lymphoma translocation protein 1
Type:Enzyme
Mol. Mass.:92257.81
Organism:Homo sapiens (Human)
Description:Q9UDY8
Residue:824
BDBM50169052
NameBDBM50169052
Synonyms:CHEMBL3806235 US9815842, Example 54
TypeSmall organic molecule
Emp. Form.C19H15ClF3N9O2
Mol. Mass.493.83
SMILESFC(F)(F)c1cc(NC(=O)Nc2cnc3cc(Cl)nn3c2C2CCCO2)cnc1-n1nccn1