Reaction Details
TargetMucosa-associated lymphoid tissue lymphoma translocation protein 1
LigandBDBM50169055
Substrate/Competitorn/a
Meas. Tech.ChEMBL_1577621 (CHEMBL3807229)
IC50 0.008000±n/a nM
Citation Abdel-Magid, AF MALT1 Inhibitors May Potentially Treat Lymphomas and Autoimmune Disorders. ACS Med Chem Lett7:205-6 (2016) 
 
Mucosa-associated lymphoid tissue lymphoma translocation protein 1
Name:Mucosa-associated lymphoid tissue lymphoma translocation protein 1
Type:Enzyme
Mol. Mass.:92257.81
Organism:Homo sapiens (Human)
Description:Q9UDY8
Residue:824
BDBM50169055
NameBDBM50169055
Synonyms:CHEMBL3806299
TypeSmall organic molecule
Emp. Form.C20H20Cl2N8O
Mol. Mass.459.332
SMILESCC(C)c1c(NC(=O)Nc2ccc(c(Cl)c2)-n2cc(CN)cn2)cnc2cc(Cl)nn12