Reaction Details
TargetMucosa-associated lymphoid tissue lymphoma translocation protein 1
LigandBDBM50169049
Substrate/Competitorn/a
Meas. Tech.ChEMBL_1577621 (CHEMBL3807229)
IC50 0.002000±n/a nM
Citation Abdel-Magid, AF MALT1 Inhibitors May Potentially Treat Lymphomas and Autoimmune Disorders. ACS Med Chem Lett7:205-6 (2016) 
 
Mucosa-associated lymphoid tissue lymphoma translocation protein 1
Name:Mucosa-associated lymphoid tissue lymphoma translocation protein 1
Type:Enzyme
Mol. Mass.:92257.81
Organism:Homo sapiens (Human)
Description:Q9UDY8
Residue:824
BDBM50169049
NameBDBM50169049
Synonyms:CHEMBL3806155 US9815842, Example 1
TypeSmall organic molecule
Emp. Form.C18H15ClF3N9O2
Mol. Mass.481.819
SMILESCO[C@@H](C)c1c(NC(=O)Nc2cnc(c(c2)C(F)(F)F)-n2nccn2)cnc2cc(Cl)nn12