Reaction Details
TargetPoly [ADP-ribose] polymerase tankyrase-2
LigandBDBM50169058
Substrate/Competitorn/a
Meas. Tech.ChEMBL_1577626 (CHEMBL3807234)
IC50 0.280±n/a nM
Citation Abdel-Magid, AF Potential Use of Inhibitors of Tankyrases and PARP-1 as Treatment for Cancer and Other Diseases. ACS Med Chem Lett7:209-10 (2016) 
 
Poly [ADP-ribose] polymerase tankyrase-2
Name:Poly [ADP-ribose] polymerase tankyrase-2
Type:Enzyme
Mol. Mass.:126937.16
Organism:Homo sapiens (Human)
Description:Q9H2K2
Residue:1166
BDBM50169058
NameBDBM50169058
Synonyms:CHEMBL3806049
TypeSmall organic molecule
Emp. Form.C23H30N6O3
Mol. Mass.438.5227
SMILESCC(C)n1cc(cn1)C(=O)C1CCN(CC1)C(=O)CCCc1nc2n(C)ccc2c(=O)[nH]1