Reaction Details
TargetPoly [ADP-ribose] polymerase tankyrase-1
LigandBDBM50169060
Substrate/Competitorn/a
Meas. Tech.ChEMBL_1577625 (CHEMBL3807233)
IC50 0.400±n/a nM
Citation Abdel-Magid, AF Potential Use of Inhibitors of Tankyrases and PARP-1 as Treatment for Cancer and Other Diseases. ACS Med Chem Lett7:209-10 (2016) 
 
Poly [ADP-ribose] polymerase tankyrase-1
Name:Poly [ADP-ribose] polymerase tankyrase-1
Type:Enzyme
Mol. Mass.:142058.03
Organism:Homo sapiens (Human)
Description:O95271
Residue:1327
BDBM50169060
NameBDBM50169060
Synonyms:CHEMBL3804939
TypeSmall organic molecule
Emp. Form.C25H29N3O4S
Mol. Mass.467.58
SMILESCOc1ccc(cc1C)C(=O)C1CCN(CC1)C(=O)CCCc1nc2c(C)scc2c(=O)[nH]1