Reaction Details
TargetBeta-secretase 1
LigandBDBM50169366
Substrate/Competitorn/a
Meas. Tech.ChEMBL_1577901 (CHEMBL3806438)
IC50 0.700000±n/a nM
Citation Wu, YJGuernon, JYang, FSnyder, LShi, JMcclure, ARajamani, RPark, HNg, ALewis, HChang, CCamac, DToyn, JHAhlijanian, MKAlbright, CFMacor, JEThompson, LA Targeting the BACE1 Active Site Flap Leads to a Potent Inhibitor That Elicits Robust Brain Aß Reduction in Rodents. ACS Med Chem Lett7:271-6 (2016) 
 
Beta-secretase 1
Name:Beta-secretase 1
Type:Protein
Mol. Mass.:55755.10
Organism:Homo sapiens (Human)
Description:P56817
Residue:501
BDBM50169366
NameBDBM50169366
Synonyms:CHEMBL3806322
TypeSmall organic molecule
Emp. Form.C22H20ClF2N5O2S
Mol. Mass.491.941
SMILESCc1noc(C)c1[C@@H]1C[C@](C)(N=C(N)S1)c1cc(NC(=O)c2ccc(Cl)cn2)cc(F)c1F