Reaction Details
TargetSodium channel protein type 9 subunit alpha
LigandBDBM50169429
Substrate/Competitorn/a
Meas. Tech.ChEMBL_1577992 (CHEMBL3806691)
IC50 222±n/a nM
Citation Focken, TLiu, SChahal, NDauphinais, MGrimwood, MEChowdhury, SHemeon, IBichler, PBogucki, DWaldbrook, MBankar, GSojo, LEYoung, CLin, SShuart, NKwan, RPang, JChang, JHSafina, BSSutherlin, DPJohnson, JPDehnhardt, CMMansour, TSOballa, RMCohen, CJRobinette, CL Discovery of Aryl Sulfonamides as Isoform-Selective Inhibitors of NaV1.7 with Efficacy in Rodent Pain Models. ACS Med Chem Lett7:277-82 (2016) 
 
Sodium channel protein type 9 subunit alpha
Name:Sodium channel protein type 9 subunit alpha
Type:Protein
Mol. Mass.:226375.97
Organism:Homo sapiens (Human)
Description:Q15858
Residue:1988
BDBM50169429
NameBDBM50169429
Synonyms:CHEMBL3805199 | US9481677, 32
TypeSmall organic molecule
Emp. Form.C20H15ClF2N6O3S2
Mol. Mass.524.951
SMILESFc1cc(c(F)cc1Oc1ccc(Cl)cc1-c1cnc2CNCCn12)S(=O)(=O)Nc1ncns1