Reaction Details
TargetSodium channel protein type 5 subunit alpha
LigandBDBM50169427
Substrate/Competitorn/a
Meas. Tech.ChEMBL_1577993 (CHEMBL3806692)
IC50>10000±n/a nM
Citation Focken, TLiu, SChahal, NDauphinais, MGrimwood, MEChowdhury, SHemeon, IBichler, PBogucki, DWaldbrook, MBankar, GSojo, LEYoung, CLin, SShuart, NKwan, RPang, JChang, JHSafina, BSSutherlin, DPJohnson, JPDehnhardt, CMMansour, TSOballa, RMCohen, CJRobinette, CL Discovery of Aryl Sulfonamides as Isoform-Selective Inhibitors of NaV1.7 with Efficacy in Rodent Pain Models. ACS Med Chem Lett7:277-82 (2016) 
 
Sodium channel protein type 5 subunit alpha
Name:Sodium channel protein type 5 subunit alpha
Type:Enzyme
Mol. Mass.:226908.60
Organism:Homo sapiens (Human)
Description:Q14524
Residue:2016
BDBM50169427
NameBDBM50169427
Synonyms:CHEMBL3805897 | US9481677, 45
TypeSmall organic molecule
Emp. Form.C21H13ClF2N6O3S2
Mol. Mass.534.946
SMILESNc1n[nH]c2ccc(cc12)-c1cc(Cl)ccc1Oc1cc(F)c(cc1F)S(=O)(=O)Nc1ncns1