Reaction Details
TargetSodium channel protein type 1 subunit alpha
LigandBDBM50118514
Substrate/Competitorn/a
Meas. Tech.ChEMBL_1577995 (CHEMBL3806744)
IC50 6380±n/a nM
Citation Focken, TLiu, SChahal, NDauphinais, MGrimwood, MEChowdhury, SHemeon, IBichler, PBogucki, DWaldbrook, MBankar, GSojo, LEYoung, CLin, SShuart, NKwan, RPang, JChang, JHSafina, BSSutherlin, DPJohnson, JPDehnhardt, CMMansour, TSOballa, RMCohen, CJRobinette, CL Discovery of Aryl Sulfonamides as Isoform-Selective Inhibitors of NaV1.7 with Efficacy in Rodent Pain Models. ACS Med Chem Lett7:277-82 (2016) 
 
Sodium channel protein type 1 subunit alpha
Name:Sodium channel protein type 1 subunit alpha
Type:Protein
Mol. Mass.:228952.47
Organism:Homo sapiens (Human)
Description:P35498
Residue:2009
BDBM50118514
NameBDBM50118514
Synonyms:CHEMBL3617063 | US9481677, 38
TypeSmall organic molecule
Emp. Form.C21H13ClF2N6O3S2
Mol. Mass.534.946
SMILESNc1nc2cc(ccc2[nH]1)-c1cc(Cl)ccc1Oc1cc(F)c(cc1F)S(=O)(=O)Nc1ncns1