Reaction Details
TargetCytochrome P450 2C19
LigandBDBM50169438
Substrate/Competitorn/a
Meas. Tech.ChEMBL_1578013 (CHEMBL3806762)
IC50>10000±n/a nM
Citation Focken, TLiu, SChahal, NDauphinais, MGrimwood, MEChowdhury, SHemeon, IBichler, PBogucki, DWaldbrook, MBankar, GSojo, LEYoung, CLin, SShuart, NKwan, RPang, JChang, JHSafina, BSSutherlin, DPJohnson, JPDehnhardt, CMMansour, TSOballa, RMCohen, CJRobinette, CL Discovery of Aryl Sulfonamides as Isoform-Selective Inhibitors of NaV1.7 with Efficacy in Rodent Pain Models. ACS Med Chem Lett7:277-82 (2016) 
 
Cytochrome P450 2C19
Name:Cytochrome P450 2C19
Type:Enzyme
Mol. Mass.:55935.47
Organism:Homo sapiens (Human)
Description:P33261
Residue:490
BDBM50169438
NameBDBM50169438
Synonyms:CHEMBL3804898 | US9481677, 63
TypeSmall organic molecule
Emp. Form.C23H14ClF2N5O4S
Mol. Mass.529.903
SMILESNc1noc2ccc(cc12)-c1cc(Cl)ccc1Oc1cc(F)c(cc1F)S(=O)(=O)Nc1ncccn1