Reaction Details
TargetSphingosine 1-phosphate receptor 1
LigandBDBM23163
Substrate/Competitorn/a
Meas. Tech.ChEMBL_1578109 (CHEMBL3807064)
EC50 0.005600±n/a nM
Citation Dhar, TGXiao, HYXie, JLehman-McKeeman, LDWu, DRDabros, MYang, XTaylor, TLZhou, XDHeimrich, EMThomas, RMcIntyre, KWWarrack, BShi, HLevesque, PCZhu, JLHennan, JBalimane, PYang, ZMarino, AMCornelius, GD'Arienzo, CJMathur, AShen, DRCvijic, MESalter-Cid, LBarrish, JCCarter, PHDyckman, AJ Identification and Preclinical Pharmacology of BMS-986104: A Differentiated S1P1 Receptor Modulator in Clinical Trials. ACS Med Chem Lett7:283-8 (2016) 
 
Sphingosine 1-phosphate receptor 1
Name:Sphingosine 1-phosphate receptor 1
Type:Enzyme
Mol. Mass.:42836.02
Organism:Homo sapiens (Human)
Description:P21453
Residue:382
BDBM23163
NameBDBM23163
Synonyms:CHEMBL114606 {2-amino-3-hydroxy-2-[2-(4-octylphenyl)ethyl]propoxy}phosphonic acid
TypeSmall organic molecule
Emp. Form.C19H34NO5P
Mol. Mass.387.4507
SMILESCCCCCCCCc1ccc(CCC(N)(CO)COP(O)(O)=O)cc1