Reaction Details
TargetMetabotropic glutamate receptor 5
LigandBDBM50169480
Substrate/Competitorn/a
Meas. Tech.ChEMBL_1578233 (CHEMBL3807497)
EC50 15±n/a nM
Citation Yang, FSnyder, LBBalakrishnan, ABrown, JMSivarao, DVEaston, AFernandes, AGulianello, MHanumegowda, UMHuang, HHuang, YJones, KMLi, YWMatchett, MMattson, GMiller, RSantone, KSSenapati, AShields, EESimutis, FJWestphal, RWhiterock, VJBronson, JJMacor, JEDegnan, AP Discovery and Preclinical Evaluation of BMS-955829, a Potent Positive Allosteric Modulator of mGluR5. ACS Med Chem Lett7:289-93 (2016) 
 
Metabotropic glutamate receptor 5
Name:Metabotropic glutamate receptor 5
Type:Enzyme
Mol. Mass.:132484.72
Organism:Homo sapiens (Human)
Description:n/a
Residue:1212
BDBM50169480
NameBDBM50169480
Synonyms:CHEMBL3805340
TypeSmall organic molecule
Emp. Form.C23H16FNO2
Mol. Mass.357.377
SMILESFc1cccc(c1)[C@H]1OC(=O)N[C@@H]1c1cccc(c1)C#Cc1ccccc1