Reaction Details
TargetMetabotropic glutamate receptor 5
LigandBDBM50169543
Substrate/Competitorn/a
Meas. Tech.ChEMBL_1578234 (CHEMBL3807498)
Ki 25±n/a nM
Citation Yang, FSnyder, LBBalakrishnan, ABrown, JMSivarao, DVEaston, AFernandes, AGulianello, MHanumegowda, UMHuang, HHuang, YJones, KMLi, YWMatchett, MMattson, GMiller, RSantone, KSSenapati, AShields, EESimutis, FJWestphal, RWhiterock, VJBronson, JJMacor, JEDegnan, AP Discovery and Preclinical Evaluation of BMS-955829, a Potent Positive Allosteric Modulator of mGluR5. ACS Med Chem Lett7:289-93 (2016) 
 
Metabotropic glutamate receptor 5
Name:Metabotropic glutamate receptor 5
Type:Enzyme
Mol. Mass.:132484.72
Organism:Homo sapiens (Human)
Description:n/a
Residue:1212
BDBM50169543
NameBDBM50169543
Synonyms:CHEMBL3806078
TypeSmall organic molecule
Emp. Form.C21H13F2N3O2
Mol. Mass.377.3436
SMILESFc1ccc(cc1)[C@H]1OC(=O)N[C@@H]1c1cncc(c1)C#Cc1cncc(F)c1