Reaction Details
TargetProstaglandin E2 receptor EP2 subtype
LigandBDBM35847
Substrate/Competitorn/a
Meas. Tech.ChEMBL_1578429 (CHEMBL3808246)
EC50 346±n/a nM
Citation Ogawa, SWatanabe, TSugimoto, IMoriyuki, KGoto, YYamane, SWatanabe, ATsuboi, KKinoshita, AKigoshi, HTani, KMaruyama, T Discovery of G Protein-Biased EP2 Receptor Agonists. ACS Med Chem Lett7:306-11 (2016) 
 
Prostaglandin E2 receptor EP2 subtype
Name:Prostaglandin E2 receptor EP2 subtype
Type:Enzyme
Mol. Mass.:39775.71
Organism:Homo sapiens (Human)
Description:P43116
Residue:358
BDBM35847
NameBDBM35847
Synonyms:(15S)-prostaglandin E2 (5Z,13E,15S)-11alpha,15-dihydroxy-9-oxoprosta-5,13-dien-1-oic acid CHEMBL548 PGE2 [3H]PGE2 prostaglandin E2
Typeradiolabeled ligand
Emp. Form.C20H32O5
Mol. Mass.352.4651
SMILESCCCCC[C@H](O)\C=C\[C@H]1[C@H](O)CC(=O)[C@@H]1C\C=C/CCCC(O)=O