Reaction Details
TargetCytochrome P450 2C9
LigandBDBM50169702
Substrate/Competitorn/a
Meas. Tech.ChEMBL_1576883 (CHEMBL3806592)
IC50>25000±n/a nM
Citation Kavanagh, MECoyne, AGMcLean, KJJames, GGLevy, CWMarino, LBde Carvalho, LPChan, DSHudson, SASurade, SLeys, DMunro, AWAbell, C Fragment-Based Approaches to the Development of Mycobacterium tuberculosis CYP121 Inhibitors. J Med Chem59:3272-302 (2016) 
 
Cytochrome P450 2C9
Name:Cytochrome P450 2C9
Type:Enzyme
Mol. Mass.:55636.33
Organism:Homo sapiens (Human)
Description:P11712
Residue:490
BDBM50169702
NameBDBM50169702
Synonyms:CHEMBL3805279
TypeSmall organic molecule
Emp. Form.C22H19N3O3
Mol. Mass.373.4046
SMILESOc1ccc(CNc2[nH]nc(c2-c2ccc(O)cc2)-c2ccc(O)cc2)cc1