Reaction Details
TargetCytochrome P450 2D6
LigandBDBM50169698
Substrate/Competitorn/a
Meas. Tech.ChEMBL_1576885 (CHEMBL3806594)
IC50>25000±n/a nM
Citation Kavanagh, MECoyne, AGMcLean, KJJames, GGLevy, CWMarino, LBde Carvalho, LPChan, DSHudson, SASurade, SLeys, DMunro, AWAbell, C Fragment-Based Approaches to the Development of Mycobacterium tuberculosis CYP121 Inhibitors. J Med Chem59:3272-302 (2016) 
 
Cytochrome P450 2D6
Name:Cytochrome P450 2D6
Type:Protein
Mol. Mass.:55774.82
Organism:Homo sapiens (Human)
Description:P10635
Residue:497
BDBM50169698
NameBDBM50169698
Synonyms:CHEMBL3806191
TypeSmall organic molecule
Emp. Form.C15H14N4
Mol. Mass.250.2985
SMILESNc1[nH]ncc1-c1cccc(c1)-c1cccc(N)c1