Reaction Details
TargetMycocyclosin synthase
LigandBDBM31773
Substrate/Competitorn/a
Meas. Tech.ChEMBL_1576820 (CHEMBL3806366)
Kd 73±n/a nM
Citation Kavanagh, MECoyne, AGMcLean, KJJames, GGLevy, CWMarino, LBde Carvalho, LPChan, DSHudson, SASurade, SLeys, DMunro, AWAbell, C Fragment-Based Approaches to the Development of Mycobacterium tuberculosis CYP121 Inhibitors. J Med Chem59:3272-302 (2016) 
 
Mycocyclosin synthase
Name:Mycocyclosin synthase
Type:PROTEIN
Mol. Mass.:43255.98
Organism:Mycobacterium tuberculosis
Description:ChEMBL_721243
Residue:396
BDBM31773
NameBDBM31773
Synonyms:ECONAZOLE Gyno-pevaryl cid_68589
TypeSmall organic molecule
Emp. Form.C18H15Cl3N2O
Mol. Mass.381.684
SMILESClc1ccc(COC(Cn2ccnc2)c2ccc(Cl)cc2Cl)cc1