Reaction Details
TargetSigma non-opioid intracellular receptor 1
LigandBDBM50170037
Substrate/Competitorn/a
Meas. Tech.ChEMBL_1576906 (CHEMBL3806615)
Ki 9.8±n/a nM
Citation Cao, XChen, YZhang, YLan, YZhang, JXu, XQiu, YZhao, SLiu, XLiu, BFZhang, G Synthesis and Biological Evaluation of Novels1 Receptor Ligands for Treating Neuropathic Pain: 6-Hydroxypyridazinones. J Med Chem59:2942-61 (2016) 
 
Sigma non-opioid intracellular receptor 1
Name:Sigma non-opioid intracellular receptor 1
Type:Protein
Mol. Mass.:25307.17
Organism:Cavia porcellus (Guinea pig)
Description:Q60492
Residue:223
BDBM50170037
NameBDBM50170037
Synonyms:CHEMBL3805081
TypeSmall organic molecule
Emp. Form.C18H22ClN3O2
Mol. Mass.347.839
SMILESClc1ccc(cc1)-n1nc(OCCCN2CCCCC2)ccc1=O