Reaction Details
TargetALK tyrosine kinase receptor
LigandBDBM50170076
Substrate/Competitorn/a
Meas. Tech.ChEMBL_1577003 (CHEMBL3806916)
IC50 59±n/a nM
Citation Menichincheri, MArdini, EMagnaghi, PAvanzi, NBanfi, PBossi, RBuffa, LCanevari, GCeriani, LColombo, MCorti, LDonati, DFasolini, MFelder, EFiorelli, CFiorentini, FGalvani, AIsacchi, ABorgia, ALMarchionni, CNesi, MOrrenius, CPanzeri, APesenti, ERusconi, LSaccardo, MBVanotti, EPerrone, EOrsini, P Discovery of Entrectinib: A New 3-Aminoindazole As a Potent Anaplastic Lymphoma Kinase (ALK), c-ros Oncogene 1 Kinase (ROS1), and Pan-Tropomyosin Receptor Kinases (Pan-TRKs) inhibitor. J Med Chem59:3392-408 (2016) 
 
ALK tyrosine kinase receptor
Name:ALK tyrosine kinase receptor
Type:Protein
Mol. Mass.:176453.10
Organism:Homo sapiens (Human)
Description:Q9UM73
Residue:1620
BDBM50170076
NameBDBM50170076
Synonyms:CHEMBL3804988
TypeSmall organic molecule
Emp. Form.C32H36F2N6O2
Mol. Mass.574.664
SMILESC[C@@H](c1ccc2[nH]nc(NC(=O)c3ccc(cc3NC3CCOCC3)N3CCN(C)CC3)c2c1)c1cc(F)cc(F)c1