Reaction Details
TargetInsulin-like growth factor 1 receptor
LigandBDBM50170107
Substrate/Competitorn/a
Meas. Tech.ChEMBL_1577152 (CHEMBL3807414)
IC50 391±n/a nM
Citation Menichincheri, MArdini, EMagnaghi, PAvanzi, NBanfi, PBossi, RBuffa, LCanevari, GCeriani, LColombo, MCorti, LDonati, DFasolini, MFelder, EFiorelli, CFiorentini, FGalvani, AIsacchi, ABorgia, ALMarchionni, CNesi, MOrrenius, CPanzeri, APesenti, ERusconi, LSaccardo, MBVanotti, EPerrone, EOrsini, P Discovery of Entrectinib: A New 3-Aminoindazole As a Potent Anaplastic Lymphoma Kinase (ALK), c-ros Oncogene 1 Kinase (ROS1), and Pan-Tropomyosin Receptor Kinases (Pan-TRKs) inhibitor. J Med Chem59:3392-408 (2016) 
 
Insulin-like growth factor 1 receptor
Name:Insulin-like growth factor 1 receptor
Type:Protein
Mol. Mass.:154776.79
Organism:Homo sapiens (Human)
Description:P08069
Residue:1367
BDBM50170107
NameBDBM50170107
Synonyms:CHEMBL3806112
TypeSmall organic molecule
Emp. Form.C32H35F2N5O2
Mol. Mass.559.6494
SMILESFc1cc(F)cc(Cc2ccc3[nH]nc(NC(=O)c4ccc(CN5CCCCC5)cc4NC4CCOCC4)c3c2)c1