Reaction Details
TargetReceptor-type tyrosine-protein kinase FLT3
LigandBDBM158154
Substrate/Competitorn/a
Meas. Tech.ChEMBL_1577154 (CHEMBL3807416)
IC50 164±n/a nM
Citation Menichincheri, MArdini, EMagnaghi, PAvanzi, NBanfi, PBossi, RBuffa, LCanevari, GCeriani, LColombo, MCorti, LDonati, DFasolini, MFelder, EFiorelli, CFiorentini, FGalvani, AIsacchi, ABorgia, ALMarchionni, CNesi, MOrrenius, CPanzeri, APesenti, ERusconi, LSaccardo, MBVanotti, EPerrone, EOrsini, P Discovery of Entrectinib: A New 3-Aminoindazole As a Potent Anaplastic Lymphoma Kinase (ALK), c-ros Oncogene 1 Kinase (ROS1), and Pan-Tropomyosin Receptor Kinases (Pan-TRKs) inhibitor. J Med Chem59:3392-408 (2016) 
 
Receptor-type tyrosine-protein kinase FLT3
Name:Receptor-type tyrosine-protein kinase FLT3
Type:Enzyme
Mol. Mass.:112888.62
Organism:Homo sapiens (Human)
Description:P36888
Residue:993
BDBM158154
NameBDBM158154
Synonyms:US10081622, Compound 11 US11059827, Compound Entrectinib US9029356, 11 US9616059, 11
TypeSmall organic molecule
Emp. Form.C31H34F2N6O2
Mol. Mass.560.6375
SMILESCN1CCN(CC1)c1ccc(C(=O)Nc2n[nH]c3ccc(Cc4cc(F)cc(F)c4)cc23)c(NC2CCOCC2)c1