Reaction Details
TargetInsulin receptor
LigandBDBM50170104
Substrate/Competitorn/a
Meas. Tech.ChEMBL_1577156 (CHEMBL3807418)
IC50 330±n/a nM
Citation Menichincheri, MArdini, EMagnaghi, PAvanzi, NBanfi, PBossi, RBuffa, LCanevari, GCeriani, LColombo, MCorti, LDonati, DFasolini, MFelder, EFiorelli, CFiorentini, FGalvani, AIsacchi, ABorgia, ALMarchionni, CNesi, MOrrenius, CPanzeri, APesenti, ERusconi, LSaccardo, MBVanotti, EPerrone, EOrsini, P Discovery of Entrectinib: A New 3-Aminoindazole As a Potent Anaplastic Lymphoma Kinase (ALK), c-ros Oncogene 1 Kinase (ROS1), and Pan-Tropomyosin Receptor Kinases (Pan-TRKs) inhibitor. J Med Chem59:3392-408 (2016) 
 
Insulin receptor
Name:Insulin receptor
Type:Receptor Tyrosine Kinase
Mol. Mass.:156322.60
Organism:Homo sapiens (Human)
Description:P06213
Residue:1382
BDBM50170104
NameBDBM50170104
Synonyms:CHEMBL3805020
TypeSmall organic molecule
Emp. Form.C32H37F2N7O
Mol. Mass.573.6793
SMILESCN1CCC(CC1)Nc1cc(ccc1C(=O)Nc1n[nH]c2ccc(Cc3cc(F)cc(F)c3)cc12)N1CCN(C)CC1