Reaction Details
TargetALK tyrosine kinase receptor
LigandBDBM50170111
Substrate/Competitorn/a
Meas. Tech.ChEMBL_1577003 (CHEMBL3806916)
IC50 99±n/a nM
Citation Menichincheri, MArdini, EMagnaghi, PAvanzi, NBanfi, PBossi, RBuffa, LCanevari, GCeriani, LColombo, MCorti, LDonati, DFasolini, MFelder, EFiorelli, CFiorentini, FGalvani, AIsacchi, ABorgia, ALMarchionni, CNesi, MOrrenius, CPanzeri, APesenti, ERusconi, LSaccardo, MBVanotti, EPerrone, EOrsini, P Discovery of Entrectinib: A New 3-Aminoindazole As a Potent Anaplastic Lymphoma Kinase (ALK), c-ros Oncogene 1 Kinase (ROS1), and Pan-Tropomyosin Receptor Kinases (Pan-TRKs) inhibitor. J Med Chem59:3392-408 (2016) 
 
ALK tyrosine kinase receptor
Name:ALK tyrosine kinase receptor
Type:Protein
Mol. Mass.:176453.10
Organism:Homo sapiens (Human)
Description:Q9UM73
Residue:1620
BDBM50170111
NameBDBM50170111
Synonyms:CHEMBL3805254
TypeSmall organic molecule
Emp. Form.C31H36F2N6O3
Mol. Mass.578.6527
SMILESCOCC(COC)Nc1cc(ccc1C(=O)Nc1n[nH]c2ccc(Cc3cc(F)cc(F)c3)cc12)N1CCN(C)CC1