Reaction Details
TargetHistamine H1 receptor
LigandBDBM50170154
Substrate/Competitorn/a
Meas. Tech.ChEMBL_1577379 (CHEMBL3806420)
Ki>10000±n/a nM
Citation Geyer, RNordemann, UStrasser, AWittmann, HJBuschauer, A Conformational Restriction and Enantioseparation Increase Potency and Selectivity of Cyanoguanidine-Type Histamine H4 Receptor Agonists. J Med Chem59:3452-70 (2016) 
 
Histamine H1 receptor
Name:Histamine H1 receptor
Type:G Protein-Coupled Receptor (GPCR)
Mol. Mass.:55808.72
Organism:Homo sapiens (Human)
Description:Cell pellets from SK-N-MC cells transfected with human H1 receptor were used in binding assay.
Residue:487
BDBM50170154
NameBDBM50170154
Synonyms:CHEMBL3806162
TypeSmall organic molecule
Emp. Form.C12H18N6
Mol. Mass.246.3115
SMILESCN\C(NC[C@H]1CC[C@H](C1)c1c[nH]cn1)=N/C#N