Reaction Details
TargetHistamine H3 receptor
LigandBDBM50170155
Substrate/Competitorn/a
Meas. Tech.ChEMBL_1577388 (CHEMBL3806522)
Ki 590±n/a nM
Citation Geyer, RNordemann, UStrasser, AWittmann, HJBuschauer, A Conformational Restriction and Enantioseparation Increase Potency and Selectivity of Cyanoguanidine-Type Histamine H4 Receptor Agonists. J Med Chem59:3452-70 (2016) 
 
Histamine H3 receptor
Name:Histamine H3 receptor
Type:G Protein-Coupled Receptor (GPCR)
Mol. Mass.:48691.47
Organism:Homo sapiens (Human)
Description:Binding assays were using CHO cells stably expressing hH3R receptors.
Residue:445
BDBM50170155
NameBDBM50170155
Synonyms:CHEMBL3805220
TypeSmall organic molecule
Emp. Form.C19H24N6S
Mol. Mass.368.499
SMILESN#C\N=C(\NCCSc1ccccc1)NC[C@@H]1CC[C@H](C1)c1c[nH]cn1