Reaction Details
TargetHistamine H4 receptor
LigandBDBM50415643
Substrate/Competitorn/a
Meas. Tech.ChEMBL_1577389 (CHEMBL3806523)
EC50 37±n/a nM
Citation Geyer, RNordemann, UStrasser, AWittmann, HJBuschauer, A Conformational Restriction and Enantioseparation Increase Potency and Selectivity of Cyanoguanidine-Type Histamine H4 Receptor Agonists. J Med Chem59:3452-70 (2016) 
 
Histamine H4 receptor
Name:Histamine H4 receptor
Type:G Protein-Coupled Receptor (GPCR)
Mol. Mass.:44517.02
Organism:Homo sapiens (Human)
Description:Binding assays were using CHO cells stably expressing hH4R receptors.
Residue:390
BDBM50415643
NameBDBM50415643
Synonyms:CHEMBL1078642 | UR-PI376
TypeSmall organic molecule
Emp. Form.C17H22N6S
Mol. Mass.342.462
SMILESN#CNC(NCCSc1ccccc1)=NCCCCc1cnc[nH]1