Reaction Details
TargetHistamine H4 receptor
LigandBDBM50170118
Substrate/Competitorn/a
Meas. Tech.ChEMBL_1577389 (CHEMBL3806523)
EC50 206±n/a nM
Citation Geyer, RNordemann, UStrasser, AWittmann, HJBuschauer, A Conformational Restriction and Enantioseparation Increase Potency and Selectivity of Cyanoguanidine-Type Histamine H4 Receptor Agonists. J Med Chem59:3452-70 (2016) 
 
Histamine H4 receptor
Name:Histamine H4 receptor
Type:G Protein-Coupled Receptor (GPCR)
Mol. Mass.:44517.02
Organism:Homo sapiens (Human)
Description:Binding assays were using CHO cells stably expressing hH4R receptors.
Residue:390
BDBM50170118
NameBDBM50170118
Synonyms:CHEMBL3804906
TypeSmall organic molecule
Emp. Form.C12H18N6
Mol. Mass.246.3115
SMILESCN\C(NC[C@H]1CC[C@@H](C1)c1c[nH]cn1)=N/C#N