Reaction Details
TargetHistamine H4 receptor
LigandBDBM50170162
Substrate/Competitorn/a
Meas. Tech.ChEMBL_1577389 (CHEMBL3806523)
EC50 44±n/a nM
Citation Geyer, RNordemann, UStrasser, AWittmann, HJBuschauer, A Conformational Restriction and Enantioseparation Increase Potency and Selectivity of Cyanoguanidine-Type Histamine H4 Receptor Agonists. J Med Chem59:3452-70 (2016) 
 
Histamine H4 receptor
Name:Histamine H4 receptor
Type:G Protein-Coupled Receptor (GPCR)
Mol. Mass.:44517.02
Organism:Homo sapiens (Human)
Description:Binding assays were using CHO cells stably expressing hH4R receptors.
Residue:390
BDBM50170162
NameBDBM50170162
Synonyms:CHEMBL3805514
TypeSmall organic molecule
Emp. Form.C5H12N4S
Mol. Mass.160.241
SMILESCC(=N)SCCNC(N)=N