Reaction Details
TargetHistamine H2 receptor
LigandBDBM50170126
Substrate/Competitorn/a
Meas. Tech.ChEMBL_1577385 (CHEMBL3806426)
Ki 10300±n/a nM
Citation Geyer, RNordemann, UStrasser, AWittmann, HJBuschauer, A Conformational Restriction and Enantioseparation Increase Potency and Selectivity of Cyanoguanidine-Type Histamine H4 Receptor Agonists. J Med Chem59:3452-70 (2016) 
 
Histamine H2 receptor
Name:Histamine H2 receptor
Type:G Protein-Coupled Receptor (GPCR)
Mol. Mass.:40115.31
Organism:Homo sapiens (Human)
Description:n/a
Residue:359
BDBM50170126
NameBDBM50170126
Synonyms:CHEMBL3805361
TypeSmall organic molecule
Emp. Form.C19H24N6S
Mol. Mass.368.499
SMILESN#C\N=C(\NCCSc1ccccc1)NC[C@H]1CC[C@@H](C1)c1c[nH]cn1