Reaction Details
TargetHistamine H4 receptor
LigandBDBM50170163
Substrate/Competitorn/a
Meas. Tech.ChEMBL_1577459 (CHEMBL3806732)
Ki 125±n/a nM
Citation Geyer, RNordemann, UStrasser, AWittmann, HJBuschauer, A Conformational Restriction and Enantioseparation Increase Potency and Selectivity of Cyanoguanidine-Type Histamine H4 Receptor Agonists. J Med Chem59:3452-70 (2016) 
 
Histamine H4 receptor
Name:Histamine H4 receptor
Type:G Protein-Coupled Receptor (GPCR)
Mol. Mass.:44517.02
Organism:Homo sapiens (Human)
Description:Binding assays were using CHO cells stably expressing hH4R receptors.
Residue:390
BDBM50170163
NameBDBM50170163
Synonyms:CHEMBL321860
TypeSmall organic molecule
Emp. Form.C11H16N6O
Mol. Mass.248.2843
SMILESC\N=C(\NC[C@H]1CC[C@@H](O1)c1c[nH]cn1)NC#N