Reaction Details
TargetMAP kinase-interacting serine/threonine-protein kinase 1
LigandBDBM50170218
Substrate/Competitorn/a
Meas. Tech.ChEMBL_1577465 (CHEMBL3806738)
IC50 370±n/a nM
Citation Cherian, JNacro, KPoh, ZYGuo, SJeyaraj, DAWong, YXHo, MYang, HYJoy, JKKwek, ZPLiu, BWee, JLOng, EHChoong, MLPoulsen, ALee, MAPendharkar, VDing, LJManoharan, VChew, YSSangthongpitag, KLim, SOng, STHill, JKeller, TH Structure-Activity Relationship Studies of Mitogen Activated Protein Kinase Interacting Kinase (MNK) 1 and 2 and BCR-ABL1 Inhibitors Targeting Chronic Myeloid Leukemic Cells. J Med Chem59:3063-78 (2016) 
 
MAP kinase-interacting serine/threonine-protein kinase 1
Name:MAP kinase-interacting serine/threonine-protein kinase 1
Type:Serine/threonine-protein kinase
Mol. Mass.:51342.85
Organism:Homo sapiens (Human)
Description:Q9BUB5
Residue:465
BDBM50170218
NameBDBM50170218
Synonyms:CHEMBL3804952
TypeSmall organic molecule
Emp. Form.C28H32F3N5O2
Mol. Mass.527.5812
SMILESCCN1CCN(Cc2ccc(NC(=O)Cc3ccc(Oc4ccnc(NC)c4)cc3)cc2C(F)(F)F)CC1