Reaction Details
TargetTyrosine-protein kinase ABL1
LigandBDBM50170168
Substrate/Competitorn/a
Meas. Tech.ChEMBL_1577467 (CHEMBL3806740)
IC50 170±n/a nM
Citation Cherian, JNacro, KPoh, ZYGuo, SJeyaraj, DAWong, YXHo, MYang, HYJoy, JKKwek, ZPLiu, BWee, JLOng, EHChoong, MLPoulsen, ALee, MAPendharkar, VDing, LJManoharan, VChew, YSSangthongpitag, KLim, SOng, STHill, JKeller, TH Structure-Activity Relationship Studies of Mitogen Activated Protein Kinase Interacting Kinase (MNK) 1 and 2 and BCR-ABL1 Inhibitors Targeting Chronic Myeloid Leukemic Cells. J Med Chem59:3063-78 (2016) 
 
Tyrosine-protein kinase ABL1
Name:Tyrosine-protein kinase ABL1
Type:Enzyme
Mol. Mass.:122897.30
Organism:Homo sapiens (Human)
Description:P00519
Residue:1130
BDBM50170168
NameBDBM50170168
Synonyms:CHEMBL3805865
TypeSmall organic molecule
Emp. Form.C29H32F3N5O3
Mol. Mass.555.5913
SMILESCCN1CCN(Cc2ccc(NC(=O)COc3ccc(cc3)-c3ccc(NC(C)=O)nc3)cc2C(F)(F)F)CC1