Reaction Details
TargetTyrosine-protein kinase ABL1
LigandBDBM50170224
Substrate/Competitorn/a
Meas. Tech.ChEMBL_1577467 (CHEMBL3806740)
IC50>10000±n/a nM
Citation Cherian, JNacro, KPoh, ZYGuo, SJeyaraj, DAWong, YXHo, MYang, HYJoy, JKKwek, ZPLiu, BWee, JLOng, EHChoong, MLPoulsen, ALee, MAPendharkar, VDing, LJManoharan, VChew, YSSangthongpitag, KLim, SOng, STHill, JKeller, TH Structure-Activity Relationship Studies of Mitogen Activated Protein Kinase Interacting Kinase (MNK) 1 and 2 and BCR-ABL1 Inhibitors Targeting Chronic Myeloid Leukemic Cells. J Med Chem59:3063-78 (2016) 
 
Tyrosine-protein kinase ABL1
Name:Tyrosine-protein kinase ABL1
Type:Enzyme
Mol. Mass.:122897.30
Organism:Homo sapiens (Human)
Description:P00519
Residue:1130
BDBM50170224
NameBDBM50170224
Synonyms:CHEMBL3804972
TypeSmall organic molecule
Emp. Form.C29H33F3N6O2
Mol. Mass.554.6065
SMILESCC(C)C(=O)Nc1ccc(cn1)-c1ccc(NCC(=O)Nc2ccc(CN3CCNCC3)c(c2)C(F)(F)F)cc1