Reaction Details
TargetTyrosine-protein kinase ABL1
LigandBDBM50170221
Substrate/Competitorn/a
Meas. Tech.ChEMBL_1577467 (CHEMBL3806740)
IC50 20±n/a nM
Citation Cherian, JNacro, KPoh, ZYGuo, SJeyaraj, DAWong, YXHo, MYang, HYJoy, JKKwek, ZPLiu, BWee, JLOng, EHChoong, MLPoulsen, ALee, MAPendharkar, VDing, LJManoharan, VChew, YSSangthongpitag, KLim, SOng, STHill, JKeller, TH Structure-Activity Relationship Studies of Mitogen Activated Protein Kinase Interacting Kinase (MNK) 1 and 2 and BCR-ABL1 Inhibitors Targeting Chronic Myeloid Leukemic Cells. J Med Chem59:3063-78 (2016) 
 
Tyrosine-protein kinase ABL1
Name:Tyrosine-protein kinase ABL1
Type:Enzyme
Mol. Mass.:122897.30
Organism:Homo sapiens (Human)
Description:P00519
Residue:1130
BDBM50170221
NameBDBM50170221
Synonyms:CHEMBL3806189
TypeSmall organic molecule
Emp. Form.C30H32F4N6O2
Mol. Mass.584.6077
SMILESCN1CCN(Cc2ccc(NC(=O)CNc3ccc(cc3F)-c3ccc(NC(=O)C4CC4)nc3)cc2C(F)(F)F)CC1