Reaction Details
TargetFibroblast growth factor receptor 2
LigandBDBM50170221
Substrate/Competitorn/a
Meas. Tech.ChEMBL_1577481 (CHEMBL3806823)
IC50 272±n/a nM
Citation Cherian, JNacro, KPoh, ZYGuo, SJeyaraj, DAWong, YXHo, MYang, HYJoy, JKKwek, ZPLiu, BWee, JLOng, EHChoong, MLPoulsen, ALee, MAPendharkar, VDing, LJManoharan, VChew, YSSangthongpitag, KLim, SOng, STHill, JKeller, TH Structure-Activity Relationship Studies of Mitogen Activated Protein Kinase Interacting Kinase (MNK) 1 and 2 and BCR-ABL1 Inhibitors Targeting Chronic Myeloid Leukemic Cells. J Med Chem59:3063-78 (2016) 
 
Fibroblast growth factor receptor 2
Name:Fibroblast growth factor receptor 2
Type:Enzyme
Mol. Mass.:92015.45
Organism:Homo sapiens (Human)
Description:P21802
Residue:821
BDBM50170221
NameBDBM50170221
Synonyms:CHEMBL3806189
TypeSmall organic molecule
Emp. Form.C30H32F4N6O2
Mol. Mass.584.6077
SMILESCN1CCN(Cc2ccc(NC(=O)CNc3ccc(cc3F)-c3ccc(NC(=O)C4CC4)nc3)cc2C(F)(F)F)CC1