Reaction Details
TargetPlatelet-derived growth factor receptor beta
LigandBDBM50170222
Substrate/Competitorn/a
Meas. Tech.ChEMBL_1577483 (CHEMBL3806825)
IC50 1083±n/a nM
Citation Cherian, JNacro, KPoh, ZYGuo, SJeyaraj, DAWong, YXHo, MYang, HYJoy, JKKwek, ZPLiu, BWee, JLOng, EHChoong, MLPoulsen, ALee, MAPendharkar, VDing, LJManoharan, VChew, YSSangthongpitag, KLim, SOng, STHill, JKeller, TH Structure-Activity Relationship Studies of Mitogen Activated Protein Kinase Interacting Kinase (MNK) 1 and 2 and BCR-ABL1 Inhibitors Targeting Chronic Myeloid Leukemic Cells. J Med Chem59:3063-78 (2016) 
 
Platelet-derived growth factor receptor beta
Name:Platelet-derived growth factor receptor beta
Type:Enzyme
Mol. Mass.:123922.25
Organism:Homo sapiens (Human)
Description:P09619
Residue:1106
BDBM50170222
NameBDBM50170222
Synonyms:CHEMBL3805771
TypeSmall organic molecule
Emp. Form.C31H35F3N6O2
Mol. Mass.580.6438
SMILESCCN1CCN(Cc2ccc(NC(=O)CNc3ccc(cc3)-c3ccc(NC(=O)C4CC4)nc3)cc2C(F)(F)F)CC1