Reaction Details
TargetRAC-alpha serine/threonine-protein kinase
LigandBDBM50170421
Substrate/Competitorn/a
Meas. Tech.ChEMBL_1577690 (CHEMBL3807471)
IC50 850±n/a nM
Citation Zhan, WXu, LDong, XDong, JYi, XMa, XQiu, NLi, JYang, BZhou, YHu, Y Design, synthesis and biological evaluation of pyrazol-furan carboxamide analogues as novel Akt kinase inhibitors. Eur J Med Chem117:47-58 (2016) 
 
RAC-alpha serine/threonine-protein kinase
Name:RAC-alpha serine/threonine-protein kinase
Type:Enzyme
Mol. Mass.:55681.25
Organism:Homo sapiens (Human)
Description:P31749
Residue:480
BDBM50170421
NameBDBM50170421
Synonyms:CHEMBL3805319
TypeSmall organic molecule
Emp. Form.C21H20Cl5N5O
Mol. Mass.535.681
SMILESCn1ncc(Cl)c1-c1c(Cl)c(C(=O)NC2(CCNCC2)c2ccc(Cl)c(Cl)c2)n(C)c1Cl